DevHeads.net

Postings by Rawhide Report

Fedora-Rawhide-20190804.n.0 compose check report

No missing expected images.

Compose FAILS proposed Rawhide gating check!
13 of 45 required tests failed, 8 results missing
openQA tests matching unsatisfied gating requirements shown with **GATING** below
Unsatisfied gating requirements that could not be mapped to openQA tests:
FAILED: compose.cloud.all

Failed openQA tests: 38/147 (x86_64), 1/2 (arm)

Old failures (same test failed in Fedora-Rawhide-20190802.n.1):

ID: 429014 Test: x86_64 Server-dvd-iso base_services_start
URL: <a href="https://openqa.fedoraproject.org/tests/429014" title="https://openqa.fedoraproject.org/tests/429014">https://openqa.fedoraproject.org/tests/429014</a>
ID: 429020 Test: x86_64 Server-dvd-iso mediakit_repoclosure
URL: http

Fedora-Rawhide-20190802.n.1 compose check report

No missing expected images.

Compose FAILS proposed Rawhide gating check!
13 of 45 required tests failed, 8 results missing
openQA tests matching unsatisfied gating requirements shown with **GATING** below
Unsatisfied gating requirements that could not be mapped to openQA tests:
FAILED: compose.cloud.all

Failed openQA tests: 40/147 (x86_64), 1/2 (arm)

New failures (same test not failed in Fedora-Rawhide-20190730.n.0):

ID: 428859 Test: x86_64 Server-dvd-iso base_services_start
URL: <a href="https://openqa.fedoraproject.org/tests/428859" title="https://openqa.fedoraproject.org/tests/428859">https://openqa.fedoraproject.org/tests/428859</a>
ID: 428870 Test: x86_64 Server-dvd-iso server_role_deploy_domain_

Fedora 31 Rawhide 20190802.n.1 nightly compose nominated for testing

Announcing the creation of a new nightly release validation test event
for Fedora 31 Rawhide 20190802.n.1. Please help run some tests for this
nightly compose if you have time.

FedoraRespin-30-updates-20190730.0 compose check report

No missing expected images.

Failed openQA tests: 1/27 (x86_64)

ID: 428120 Test: x86_64 KDE-live-iso desktop_notifications_live
URL: <a href="https://openqa.fedoraproject.org/tests/428120" title="https://openqa.fedoraproject.org/tests/428120">https://openqa.fedoraproject.org/tests/428120</a>

Soft failed openQA tests: 1/27 (x86_64)
(Tests completed, but using a workaround for a known bug)

ID: 428103 Test: x86_64 Workstation-live-iso desktop_update_graphical
URL: <a href="https://openqa.fedoraproject.org/tests/428103" title="https://openqa.fedoraproject.org/tests/428103">https://openqa.fedoraproject.org/tests/428103</a>

Passed openQA tests: 25/27 (x86_64)

Fedora-Rawhide-20190730.n.0 compose check report

No missing expected images.

Compose FAILS proposed Rawhide gating check!
4 of 45 required tests failed, 4 results missing
openQA tests matching unsatisfied gating requirements shown with **GATING** below

Failed openQA tests: 18/147 (x86_64), 1/2 (arm)

New failures (same test not failed in Fedora-Rawhide-20190729.n.0):

ID: 427749 Test: x86_64 KDE-live-iso apps_startstop
URL: <a href="https://openqa.fedoraproject.org/tests/427749" title="https://openqa.fedoraproject.org/tests/427749">https://openqa.fedoraproject.org/tests/427749</a>
ID: 427780 Test: x86_64 universal install_btrfs
URL: <a href="https://openqa.fedoraproject.org/tests/427780" title="https://openqa.fedoraproject.org/tests/427780">https://openqa.fedoraproject.org/tests/427780</a>
ID: 427808 Test: x86_64 universal install_btrfs@uefi
URL: <a href="https://openqa.f" title="https://openqa.f">https://openqa.f</a>

Fedora-Rawhide-20190729.n.0 compose check report

No missing expected images.

Compose FAILS proposed Rawhide gating check!
4 of 45 required tests failed, 4 results missing
openQA tests matching unsatisfied gating requirements shown with **GATING** below

Failed openQA tests: 21/147 (x86_64), 1/2 (arm)

New failures (same test not failed in Fedora-Rawhide-20190728.n.1):

ID: 427398 Test: x86_64 KDE-live-iso apps_startstop
URL: <a href="https://openqa.fedoraproject.org/tests/427398" title="https://openqa.fedoraproject.org/tests/427398">https://openqa.fedoraproject.org/tests/427398</a>
ID: 427399 Test: x86_64 KDE-live-iso desktop_notifications_postinstall
URL: <a href="https://openqa.fedoraproject.org/tests/427399" title="https://openqa.fedoraproject.org/tests/427399">https://openqa.fedoraproject.org/tests/427399</a>
ID: 427436 Test: x86_64 universal install_blivet_bt

Fedora-Rawhide-20190728.n.1 compose check report

No missing expected images.

Compose FAILS proposed Rawhide gating check!
7 of 45 required tests failed, 4 results missing
openQA tests matching unsatisfied gating requirements shown with **GATING** below

Failed openQA tests: 22/147 (x86_64), 1/2 (arm)

New failures (same test not failed in Fedora-Rawhide-20190727.n.0):

ID: 427091 Test: x86_64 Server-dvd-iso mediakit_repoclosure
URL: <a href="https://openqa.fedoraproject.org/tests/427091" title="https://openqa.fedoraproject.org/tests/427091">https://openqa.fedoraproject.org/tests/427091</a>
ID: 427096 Test: x86_64 Server-dvd-iso server_role_deploy_domain_controller **GATING**
URL: <a href="https://openqa.fedoraproject.org/tests/427096" title="https://openqa.fedoraproject.org/tests/427096">https://openqa.fedoraproject.org/tests/427096</a>
ID: 427097 Test: x86_64 Ser

Fedora-Rawhide-20190727.n.0 compose check report

No missing expected images.

Compose FAILS proposed Rawhide gating check!
3 of 45 required tests failed, 4 results missing
openQA tests matching unsatisfied gating requirements shown with **GATING** below
Unsatisfied gating requirements that could not be mapped to openQA tests:
FAILED: compose.cloud.all

Failed openQA tests: 14/147 (x86_64), 1/2 (arm)

New failures (same test not failed in Fedora-Rawhide-20190726.n.0):

ID: 426877 Test: x86_64 Server-dvd-iso install_repository_nfs_graphical
URL: <a href="https://openqa.fedoraproject.org/tests/426877" title="https://openqa.fedoraproject.org/tests/426877">https://openqa.fedoraproject.org/tests/426877</a>
ID: 426899 Test: x86_64 Workstation-live-iso install_

Fedora-Rawhide-20190726.n.0 compose check report

No missing expected images.

Compose PASSES proposed Rawhide gating check!
All required tests passed

Failed openQA tests: 6/147 (x86_64), 1/2 (arm)

New failures (same test not failed in Fedora-Rawhide-20190725.n.0):

ID: 426641 Test: x86_64 KDE-live-iso desktop_notifications_postinstall
URL: <a href="https://openqa.fedoraproject.org/tests/426641" title="https://openqa.fedoraproject.org/tests/426641">https://openqa.fedoraproject.org/tests/426641</a>
ID: 426671 Test: x86_64 universal install_btrfs
URL: <a href="https://openqa.fedoraproject.org/tests/426671" title="https://openqa.fedoraproject.org/tests/426671">https://openqa.fedoraproject.org/tests/426671</a>

Old failures (same test failed in Fedora-Rawhide-20190725.n.0):

ID: 426642 Test: arm Minimal-raw_xz-raw.xz install_arm_image_deployment_upload
URL: <a href="https://op" title="https://op">https://op</a>

Fedora 31 Rawhide 20190726.n.0 nightly compose nominated for testing

Announcing the creation of a new nightly release validation test event
for Fedora 31 Rawhide 20190726.n.0. Please help run some tests for this
nightly compose if you have time.

Fedora-Rawhide-20190725.n.0 compose check report

No missing expected images.

Compose FAILS proposed Rawhide gating check!
3 of 45 required tests failed
openQA tests matching unsatisfied gating requirements shown with **GATING** below

Failed openQA tests: 12/147 (x86_64), 1/2 (arm)

New failures (same test not failed in Fedora-Rawhide-20190724.n.0):

ID: 426291 Test: x86_64 Server-dvd-iso server_remote_logging_server
URL: <a href="https://openqa.fedoraproject.org/tests/426291" title="https://openqa.fedoraproject.org/tests/426291">https://openqa.fedoraproject.org/tests/426291</a>
ID: 426292 Test: x86_64 Server-dvd-iso server_remote_logging_client
URL: <a href="https://openqa.fedoraproject.org/tests/426292" title="https://openqa.fedoraproject.org/tests/426292">https://openqa.fedoraproject.org/tests/426292</a>
ID: 426318 Test: x86_64 KDE-live-iso install_no_user **GA

Fedora-Rawhide-20190724.n.0 compose check report

No missing expected images.

Compose FAILS proposed Rawhide gating check!
4 of 45 required tests failed, 4 results missing
openQA tests matching unsatisfied gating requirements shown with **GATING** below
Unsatisfied gating requirements that could not be mapped to openQA tests:
FAILED: compose.cloud.all

Failed openQA tests: 13/147 (x86_64), 1/2 (arm)

New failures (same test not failed in Fedora-Rawhide-20190723.n.0):

ID: 425894 Test: x86_64 Server-dvd-iso install_repository_hd_variation
URL: <a href="https://openqa.fedoraproject.org/tests/425894" title="https://openqa.fedoraproject.org/tests/425894">https://openqa.fedoraproject.org/tests/425894</a>
ID: 425895 Test: x86_64 Server-dvd-iso server_role_dep

Fedora-Rawhide-20190723.n.0 compose check report

No missing expected images.

Compose FAILS proposed Rawhide gating check!
23 of 47 required tests failed, 19 results missing
openQA tests matching unsatisfied gating requirements shown with **GATING** below
Unsatisfied gating requirements that could not be mapped to openQA tests:
MISSING: fedora.universal.i386.64bit - compose.install_repository_http_graphical
MISSING: fedora.universal.i386.64bit - compose.install_scsi_updates_img

Failed openQA tests: 78/147 (x86_64), 1/2 (arm)

Old failures (same test failed in Fedora-Rawhide-20190722.n.1):

ID: 425290 Test: x86_64 Server-boot-iso install_def

Fedora-Rawhide-20190722.n.1 compose check report

No missing expected images.

Compose FAILS proposed Rawhide gating check!
24 of 47 required tests failed, 19 results missing
openQA tests matching unsatisfied gating requirements shown with **GATING** below
Unsatisfied gating requirements that could not be mapped to openQA tests:
FAILED: compose.cloud.all
MISSING: fedora.universal.i386.64bit - compose.install_repository_http_graphical
MISSING: fedora.universal.i386.64bit - compose.install_scsi_updates_img

Failed openQA tests: 78/147 (x86_64), 1/2 (arm)

New failures (same test not failed in Fedora-Rawhide-20190721.n.0):

ID: 424911 Test: x86_

Fedora 31 Rawhide 20190722.n.1 nightly compose nominated for testing

Announcing the creation of a new nightly release validation test event
for Fedora 31 Rawhide 20190722.n.1. Please help run some tests for this
nightly compose if you have time.

Fedora-Rawhide-20190721.n.0 compose check report

No missing expected images.

Compose FAILS proposed Rawhide gating check!
27 of 47 required tests failed, 19 results missing
openQA tests matching unsatisfied gating requirements shown with **GATING** below
Unsatisfied gating requirements that could not be mapped to openQA tests:
MISSING: fedora.universal.i386.64bit - compose.install_repository_http_graphical
MISSING: fedora.universal.i386.64bit - compose.install_scsi_updates_img

Failed openQA tests: 98/147 (x86_64), 1/2 (arm)

New failures (same test not failed in Fedora-Rawhide-20190720.n.1):

ID: 424278 Test: x86_64 universal install_kicks

Fedora-Rawhide-20190720.n.1 compose check report

No missing expected images.

Compose FAILS proposed Rawhide gating check!
24 of 47 required tests failed, 19 results missing
openQA tests matching unsatisfied gating requirements shown with **GATING** below
Unsatisfied gating requirements that could not be mapped to openQA tests:
MISSING: fedora.universal.i386.64bit - compose.install_repository_http_graphical
MISSING: fedora.universal.i386.64bit - compose.install_scsi_updates_img

Failed openQA tests: 93/147 (x86_64), 1/2 (arm)

New failures (same test not failed in Fedora-Rawhide-20190719.n.1):

ID: 424006 Test: x86_64 Server-boot-iso install